{"text_format":"1","workbook":"xlsx","n_sheets":3,"sheets":["SIMULADOR","INFORMACION REQUERIDA","Hoja2"],"not_rendered":{"charts":0,"images":2,"macros":1,"external_links":1,"defined_names":73,"comments":1,"pivot_tables":0},"unopened":[],"bounds":{"document_bytes":16777216,"sheet_cells":100000,"rows_first":2000,"rows_last":500,"rows_between":2000,"halvings":0,"cell_chars":16384,"cell_head_chars":4096},"cells_cut":0,"cells_raw":0,"read":"whole","date_system":"1900"}

{"sheet":"SIMULADOR","index":0,"n_rows":381,"n_cols":19,"rows_kept":381,"cut":false,"hidden":false,"merged":[[20,1,20,5],[3,7,3,9],[15,1,15,2],[15,7,15,8],[16,1,16,2],[16,7,16,8],[17,1,17,2],[18,1,18,2],[18,7,18,9],[12,1,12,2],[12,7,12,8],[13,1,13,2],[13,7,13,8],[8,1,8,3],[8,8,8,9],[14,1,14,2],[12,11,12,14],[14,7,14,8],[9,7,9,8],[10,7,10,8],[11,7,11,8],[0,7,0,8],[1,7,1,8],[11,1,11,2],[10,1,10,2],[9,1,9,2],[4,7,4,9],[5,7,5,9],[6,8,6,9],[7,8,7,9]]}
[null,null,null,null,null,null,null,"TIPO DE TASA"]
[null,null,null,null,null,null,null,"IBR",null,null,{"$f":"ABS((SUM(J24:J1048576)-J10))","v":0}]
[null,null,null,null,null,null,null,null,null,null,"Tasa Subs inicial",{"$f":"VLOOKUP($H$6,Hoja2!$B$2:$F$206,2,0)","v":6}]
[null,null,null,null,null,null,null,"REESTRUCTURACION",null,null,"Tasa Int Inicial",{"$f":"IF($H$2=\"IBR\",VLOOKUP($H$6,Hoja2!$B$2:$F$206,5,0),VLOOKUP($H$6,Hoja2!$B$2:$F$206,4,0))","v":0},null,"IBR"]
[null,null,null,null,null,null,null,{"$f":"IF((SUM(J24:J376)-Vr_Prestamo)=0,\"\",\"Verificar los Flujos de la Operación Propuesta\")","v":""},null,null,{"$f":"ABS(IF(K2>0,0,ABS((SUM(J24:J376)-J10))))","v":0},{"$f":"+L3+L4","v":6}]
[null,null,null,null,null,null,null,"AIS 2007 PEQUEÑO PRODUCTOR",null,null,null,null,null,null,"NUEVA TASA BENEF",{"$f":"+IF(O7<L4,\"REVISAR TASA BENEF\",\"OK\")","v":"OK"}]
[null,null,null,null,null,null,null,"Beneficiario",null,null,null,null,null,null,{"$f":"+(L3-J14)+L4","v":6}]
[null,null,null,null,null,null,null,"ID Beneficiario"]
[null,null,null,null,null,null,null,"N° AGROS"]
[null,null,null,null,null,null,null,"Saldo Operación"]
[null,null,null,null,null,null,null,"Cuotas a proyectar"]
[null,null,null,null,null,null,null,"Fecha Inicio Normalizacion"]
[null,null,null,null,null,null,null,"Tasa_Finagro",null,null,null,"DISPONIBILIDAD"]
[null,null,null,null,null,null,null,"Tasa Int. Financiero",null,null,null,"Valor Subsidio Disponible"]
[null,null,null,null,null,null,null,"Valor Subs_Finagro"]
[null,null,null,null,null,null,null,"Valor Subs_Int. Financiero",null,{"$f":"+SUM(O24:O100)","v":0}]
[null,null,null,null,null,null,null,"Total Subsidio",null,{"$f":"IF(ISERROR(J15+J16),0,J15+J16)","v":0},null,{"$f":"+IF(K6>10000,1,0)","v":0}]
[]
[null,null,null,null,null,null,null,{"$f":"IF(J14>L3,\"NUEVA TASA MAYOR A TASA INICIAL NORMALIZACION VIABLE\",IF(K2>0,\"Revise los Flujos de la operación Inicial\",IF(K5>0,\"Revise los Flujos de la operación Propuesta\",IF(O14-J17>=0,\"NORMALIZACION VIABLE\",\"NORMALIZACION NO VIABLE\"))))","v":"NORMALIZACION VIABLE"}]
[null,null,null,null,null,null,null,null,null,null,null,null,null,null,null,null,null,null,{"$f":"+No_Años2","v":0}]
[]
[null,null,null,null,null,null,null,"Pago Nº","F. Pagos","Flujos Capital","Saldo final","Subsidio Finagro","PLAZO","TASA NOMINAL","Vr Subsidio IF"]
[]
[null,{"$f":"IF(Values_Entered,1,\"\")","v":1},null,null,null,{"$f":"IF(OR(E24=0,E24=\"OK\"),0,DAYS360(Fecha_Inicio,E24))","v":0},null,1,null,null,{"$f":"+J10-J24","v":0},{"$f":"IFERROR(ROUND((J10*(ROUND(((1+$J$13/100)^((DAYS360(Fecha_Inicio,I24,1))/360)-1)*(360/(DAYS360(Fecha_Inicio,I24,1))),4)))/(360/DAYS360(Fecha_Inicio,I24,1)),0),0)","v":0},{"$f":"+IF($H$2=\"IBR\",(I24-Fecha_Inicio),DAYS360(Fecha_Inicio,I24))","v":0},{"$f":"IFERROR(IF($H$2=\"IBR\",(ROUND(((1+($J$14%))^(1/(365/M24))-1)*(365/M24),10)),ROUND(((1+($J$14%))^(1/(360/M24))-1)*(360/M24),10)),0)","v":0},{"$f":"+IFERROR(IF($H$2=\"IBR\",ROUND(J10*N24/365*M24,0),ROUND(J10*N24/360*M24,0)),0)","v":0}]
[null,{"$f":"IF(AND(F24>0,E24>1),IF(Values_Entered,B24+0,\"\"),IF(Values_Entered,B24+1,\"\"))","v":2},null,null,null,{"$f":"IF(AND(F24>0,E24>0),(360/Pagos_Anuales)-F24,IF(OR(E25=0,E25=\"OK\"),0,DAYS360(C24,E25)))","v":0},null,{"$f":"IF(Values_Entered,H24+1,\"\")","v":2},null,null,{"$f":"+K24-J25","v":0},{"$f":"IFERROR(ROUND((K24*(ROUND(((1+$J$13/100)^((DAYS360(I24,I25,1))/360)-1)*(360/(DAYS360(I24,I25,1))),4)))/(360/DAYS360(I24,I25,1)),0),0)","v":0},{"$f":"+IF($H$2=\"IBR\",(I25-I24),DAYS360(I24,I25))","v":0},{"$f":"IFERROR(IF($H$2=\"IBR\",(ROUND(((1+($J$14%))^(1/(365/M25))-1)*(365/M25),10)),ROUND(((1+($J$14%))^(1/(360/M25))-1)*(360/M25),10)),0)","v":0},{"$f":"+IFERROR(IF($H$2=\"IBR\",ROUND(K24*N25/365*M25,0),ROUND(K24*N25/360*M25,0)),0)","v":0}]
[null,{"$f":"IF(AND(F25>0,E25>1),IF(Values_Entered,B25+0,\"\"),IF(Values_Entered,B25+1,\"\"))","v":3},null,null,{"$f":"+IF($D$15>C26,\"OK\",0)","v":0},0,null,{"$f":"IF(Values_Entered,H25+1,\"\")","v":3},null,null,0,0,{"$f":"+IF($H$2=\"IBR\",(I26-I25),DAYS360(I25,I26))","v":0},{"$f":"IFERROR(IF($H$2=\"IBR\",(ROUND(((1+($J$14%))^(1/(365/M26))-1)*(365/M26),10)),ROUND(((1+($J$14%))^(1/(360/M26))-1)*(360/M26),10)),0)","v":0},{"$f":"+IFERROR(IF($H$2=\"IBR\",ROUND(K25*N26/365*M26,0),ROUND(K25*N26/360*M26,0)),0)","v":0}]
[null,{"$f":"IF(AND(F26>0,E26>1),IF(Values_Entered,B26+0,\"\"),IF(Values_Entered,B26+1,\"\"))","v":4},null,null,0,0,null,{"$f":"IF(Values_Entered,H26+1,\"\")","v":4},null,null,0,0,0,0,0]
[null,{"$f":"IF(AND(F27>0,E27>1),IF(Values_Entered,B27+0,\"\"),IF(Values_Entered,B27+1,\"\"))","v":5},null,null,0,0,null,{"$f":"IF(Values_Entered,H27+1,\"\")","v":5},null,null,0,0,0,0,0]
[null,{"$f":"IF(AND(F28>0,E28>1),IF(Values_Entered,B28+0,\"\"),IF(Values_Entered,B28+1,\"\"))","v":6},null,null,0,0,null,{"$f":"IF(Values_Entered,H28+1,\"\")","v":6},null,null,{"$f":"+K28-J29","v":0},{"$f":"IFERROR(ROUND((K28*(ROUND(((1+$J$13/100)^((DAYS360(I28,I29,1))/360)-1)*(360/(DAYS360(I28,I29,1))),4)))/(360/DAYS360(I28,I29,1)),0),0)","v":0},0,0,0]
[null,{"$f":"IF(AND(F29>0,E29>1),IF(Values_Entered,B29+0,\"\"),IF(Values_Entered,B29+1,\"\"))","v":7},null,null,0,0,null,{"$f":"IF(Values_Entered,H29+1,\"\")","v":7},null,null,0,0,0,0,0]
[null,{"$f":"IF(AND(F30>0,E30>1),IF(Values_Entered,B30+0,\"\"),IF(Values_Entered,B30+1,\"\"))","v":8},null,null,0,0,null,{"$f":"IF(Values_Entered,H30+1,\"\")","v":8},null,null,0,0,0,0,0]
[null,{"$f":"IF(AND(F31>0,E31>1),IF(Values_Entered,B31+0,\"\"),IF(Values_Entered,B31+1,\"\"))","v":9},null,null,0,0,null,{"$f":"IF(Values_Entered,H31+1,\"\")","v":9},null,null,0,0,0,0,0]
[null,{"$f":"IF(AND(F32>0,E32>1),IF(Values_Entered,B32+0,\"\"),IF(Values_Entered,B32+1,\"\"))","v":10},null,null,0,0,null,{"$f":"IF(Values_Entered,H32+1,\"\")","v":10},null,null,0,0,0,0,0]
[null,{"$f":"IF(AND(F33>0,E33>1),IF(Values_Entered,B33+0,\"\"),IF(Values_Entered,B33+1,\"\"))","v":11},null,null,0,0,null,{"$f":"IF(Values_Entered,H33+1,\"\")","v":11},null,null,0,0,0,0,0]
[null,{"$f":"IF(AND(F34>0,E34>1),IF(Values_Entered,B34+0,\"\"),IF(Values_Entered,B34+1,\"\"))","v":12},null,null,0,0,null,{"$f":"IF(Values_Entered,H34+1,\"\")","v":12},null,null,0,0,0,0,0]
[null,{"$f":"IF(AND(F35>0,E35>1),IF(Values_Entered,B35+0,\"\"),IF(Values_Entered,B35+1,\"\"))","v":13},null,null,0,0,null,{"$f":"IF(Values_Entered,H35+1,\"\")","v":13},null,null,0,0,0,0,0]
[null,{"$f":"IF(AND(F36>0,E36>1),IF(Values_Entered,B36+0,\"\"),IF(Values_Entered,B36+1,\"\"))","v":14},null,null,0,0,null,{"$f":"IF(Values_Entered,H36+1,\"\")","v":14},null,null,0,0,0,0,0]
[null,{"$f":"IF(AND(F37>0,E37>1),IF(Values_Entered,B37+0,\"\"),IF(Values_Entered,B37+1,\"\"))","v":15},null,null,0,0,null,{"$f":"IF(Values_Entered,H37+1,\"\")","v":15},null,null,0,0,0,0,0]
[null,{"$f":"IF(AND(F38>0,E38>1),IF(Values_Entered,B38+0,\"\"),IF(Values_Entered,B38+1,\"\"))","v":16},null,null,0,0,null,{"$f":"IF(Values_Entered,H38+1,\"\")","v":16},null,null,0,0,0,0,0]
[null,{"$f":"IF(AND(F39>0,E39>1),IF(Values_Entered,B39+0,\"\"),IF(Values_Entered,B39+1,\"\"))","v":17},null,null,0,0,null,{"$f":"IF(Values_Entered,H39+1,\"\")","v":17},null,null,0,0,0,0,0]
[null,{"$f":"IF(AND(F40>0,E40>1),IF(Values_Entered,B40+0,\"\"),IF(Values_Entered,B40+1,\"\"))","v":18},null,null,0,0,null,{"$f":"IF(Values_Entered,H40+1,\"\")","v":18},null,null,0,0,0,0,0]
[null,{"$f":"IF(AND(F41>0,E41>1),IF(Values_Entered,B41+0,\"\"),IF(Values_Entered,B41+1,\"\"))","v":19},null,null,0,0,null,{"$f":"IF(Values_Entered,H41+1,\"\")","v":19},null,null,0,0,0,0,0]
[null,{"$f":"IF(AND(F42>0,E42>1),IF(Values_Entered,B42+0,\"\"),IF(Values_Entered,B42+1,\"\"))","v":20},null,null,0,0,null,{"$f":"IF(Values_Entered,H42+1,\"\")","v":20},null,null,0,0,0,0,0]
[null,{"$f":"IF(AND(F43>0,E43>1),IF(Values_Entered,B43+0,\"\"),IF(Values_Entered,B43+1,\"\"))","v":21},null,null,0,0,null,{"$f":"IF(Values_Entered,H43+1,\"\")","v":21},null,null,0,0,0,0,0]
[null,{"$f":"IF(AND(F44>0,E44>1),IF(Values_Entered,B44+0,\"\"),IF(Values_Entered,B44+1,\"\"))","v":22},null,null,0,0,null,{"$f":"IF(Values_Entered,H44+1,\"\")","v":22},null,null,0,0,0,0,0]
[null,{"$f":"IF(AND(F45>0,E45>1),IF(Values_Entered,B45+0,\"\"),IF(Values_Entered,B45+1,\"\"))","v":23},null,null,0,0,null,{"$f":"IF(Values_Entered,H45+1,\"\")","v":23},null,null,0,0,0,0,0]
[null,{"$f":"IF(AND(F46>0,E46>1),IF(Values_Entered,B46+0,\"\"),IF(Values_Entered,B46+1,\"\"))","v":24},null,null,0,0,null,{"$f":"IF(Values_Entered,H46+1,\"\")","v":24},null,null,0,0,0,0,0]
[null,{"$f":"IF(AND(F47>0,E47>1),IF(Values_Entered,B47+0,\"\"),IF(Values_Entered,B47+1,\"\"))","v":25},null,null,0,0,null,{"$f":"IF(Values_Entered,H47+1,\"\")","v":25},null,null,0,0,0,0,0]
[null,{"$f":"IF(AND(F48>0,E48>1),IF(Values_Entered,B48+0,\"\"),IF(Values_Entered,B48+1,\"\"))","v":26},null,null,0,0,null,{"$f":"IF(Values_Entered,H48+1,\"\")","v":26},null,null,0,0,0,0,0]
[null,{"$f":"IF(AND(F49>0,E49>1),IF(Values_Entered,B49+0,\"\"),IF(Values_Entered,B49+1,\"\"))","v":27},null,null,0,0,null,{"$f":"IF(Values_Entered,H49+1,\"\")","v":27},null,null,0,0,0,0,0]
[null,{"$f":"IF(AND(F50>0,E50>1),IF(Values_Entered,B50+0,\"\"),IF(Values_Entered,B50+1,\"\"))","v":28},null,null,0,0,null,{"$f":"IF(Values_Entered,H50+1,\"\")","v":28},null,null,0,0,0,0,0]
[null,{"$f":"IF(AND(F51>0,E51>1),IF(Values_Entered,B51+0,\"\"),IF(Values_Entered,B51+1,\"\"))","v":29},null,null,0,0,null,{"$f":"IF(Values_Entered,H51+1,\"\")","v":29},null,null,0,0,0,0,0]
[null,{"$f":"IF(AND(F52>0,E52>1),IF(Values_Entered,B52+0,\"\"),IF(Values_Entered,B52+1,\"\"))","v":30},null,null,0,0,null,{"$f":"IF(Values_Entered,H52+1,\"\")","v":30},null,null,0,0,0,0,0]
[null,{"$f":"IF(AND(F53>0,E53>1),IF(Values_Entered,B53+0,\"\"),IF(Values_Entered,B53+1,\"\"))","v":31},null,null,0,0,null,{"$f":"IF(Values_Entered,H53+1,\"\")","v":31},null,null,0,0,0,0,0]
[null,{"$f":"IF(AND(F54>0,E54>1),IF(Values_Entered,B54+0,\"\"),IF(Values_Entered,B54+1,\"\"))","v":32},null,null,0,0,null,{"$f":"IF(Values_Entered,H54+1,\"\")","v":32},null,null,0,0,0,0,0]
[null,{"$f":"IF(AND(F55>0,E55>1),IF(Values_Entered,B55+0,\"\"),IF(Values_Entered,B55+1,\"\"))","v":33},null,null,0,0,null,{"$f":"IF(Values_Entered,H55+1,\"\")","v":33},null,null,0,0,0,0,0]
[null,{"$f":"IF(AND(F56>0,E56>1),IF(Values_Entered,B56+0,\"\"),IF(Values_Entered,B56+1,\"\"))","v":34},null,null,0,0,null,{"$f":"IF(Values_Entered,H56+1,\"\")","v":34},null,null,0,0,0,0,0]
[null,{"$f":"IF(AND(F57>0,E57>1),IF(Values_Entered,B57+0,\"\"),IF(Values_Entered,B57+1,\"\"))","v":35},null,null,0,0,null,{"$f":"IF(Values_Entered,H57+1,\"\")","v":35},null,null,0,0,0,0,0]
[null,{"$f":"IF(AND(F58>0,E58>1),IF(Values_Entered,B58+0,\"\"),IF(Values_Entered,B58+1,\"\"))","v":36},null,null,0,0,null,{"$f":"IF(Values_Entered,H58+1,\"\")","v":36},null,null,0,0,0,0,0]
[null,{"$f":"IF(AND(F59>0,E59>1),IF(Values_Entered,B59+0,\"\"),IF(Values_Entered,B59+1,\"\"))","v":37},null,null,0,0,null,{"$f":"IF(Values_Entered,H59+1,\"\")","v":37},null,null,0,0,0,0,0]
[null,{"$f":"IF(AND(F60>0,E60>1),IF(Values_Entered,B60+0,\"\"),IF(Values_Entered,B60+1,\"\"))","v":38},null,null,0,0,null,{"$f":"IF(Values_Entered,H60+1,\"\")","v":38},null,null,0,0,0,0,0]
[null,{"$f":"IF(AND(F61>0,E61>1),IF(Values_Entered,B61+0,\"\"),IF(Values_Entered,B61+1,\"\"))","v":39},null,null,0,0,null,{"$f":"IF(Values_Entered,H61+1,\"\")","v":39},null,null,0,0,0,0,0]
[null,{"$f":"IF(AND(F62>0,E62>1),IF(Values_Entered,B62+0,\"\"),IF(Values_Entered,B62+1,\"\"))","v":40},null,null,0,0,null,{"$f":"IF(Values_Entered,H62+1,\"\")","v":40},null,null,0,0,0,0,0]
[null,{"$f":"IF(AND(F63>0,E63>1),IF(Values_Entered,B63+0,\"\"),IF(Values_Entered,B63+1,\"\"))","v":41},null,null,0,0,null,{"$f":"IF(Values_Entered,H63+1,\"\")","v":41},null,null,0,0,0,0,0]
[null,{"$f":"IF(AND(F64>0,E64>1),IF(Values_Entered,B64+0,\"\"),IF(Values_Entered,B64+1,\"\"))","v":42},null,null,0,0,null,{"$f":"IF(Values_Entered,H64+1,\"\")","v":42},null,null,0,0,0,0,0]
[null,{"$f":"IF(AND(F65>0,E65>1),IF(Values_Entered,B65+0,\"\"),IF(Values_Entered,B65+1,\"\"))","v":43},null,null,0,0,null,{"$f":"IF(Values_Entered,H65+1,\"\")","v":43},null,null,0,0,0,0,0]
[null,{"$f":"IF(AND(F66>0,E66>1),IF(Values_Entered,B66+0,\"\"),IF(Values_Entered,B66+1,\"\"))","v":44},null,null,0,0,null,{"$f":"IF(Values_Entered,H66+1,\"\")","v":44},null,null,0,0,0,0,0]
[null,{"$f":"IF(AND(F67>0,E67>1),IF(Values_Entered,B67+0,\"\"),IF(Values_Entered,B67+1,\"\"))","v":45},null,null,0,0,null,{"$f":"IF(Values_Entered,H67+1,\"\")","v":45},null,null,0,0,0,0,0]
[null,{"$f":"IF(AND(F68>0,E68>1),IF(Values_Entered,B68+0,\"\"),IF(Values_Entered,B68+1,\"\"))","v":46},null,null,0,0,null,{"$f":"IF(Values_Entered,H68+1,\"\")","v":46},null,null,0,0,0,0,0]
[null,{"$f":"IF(AND(F69>0,E69>1),IF(Values_Entered,B69+0,\"\"),IF(Values_Entered,B69+1,\"\"))","v":47},null,null,0,0,null,{"$f":"IF(Values_Entered,H69+1,\"\")","v":47},null,null,0,0,0,0,0]
[null,{"$f":"IF(AND(F70>0,E70>1),IF(Values_Entered,B70+0,\"\"),IF(Values_Entered,B70+1,\"\"))","v":48},null,null,0,0,null,{"$f":"IF(Values_Entered,H70+1,\"\")","v":48},null,null,0,0,0,0,0]
[null,{"$f":"IF(AND(F71>0,E71>1),IF(Values_Entered,B71+0,\"\"),IF(Values_Entered,B71+1,\"\"))","v":49},null,null,0,0,null,{"$f":"IF(Values_Entered,H71+1,\"\")","v":49},null,null,0,0,0,0,0]
[null,{"$f":"IF(AND(F72>0,E72>1),IF(Values_Entered,B72+0,\"\"),IF(Values_Entered,B72+1,\"\"))","v":50},null,null,0,0,null,{"$f":"IF(Values_Entered,H72+1,\"\")","v":50},null,null,0,0,0,0,0]
[null,{"$f":"IF(AND(F73>0,E73>1),IF(Values_Entered,B73+0,\"\"),IF(Values_Entered,B73+1,\"\"))","v":51},null,null,0,0,null,{"$f":"IF(Values_Entered,H73+1,\"\")","v":51},null,null,0,0,0,0,0]
[null,{"$f":"IF(AND(F74>0,E74>1),IF(Values_Entered,B74+0,\"\"),IF(Values_Entered,B74+1,\"\"))","v":52},null,null,0,0,null,{"$f":"IF(Values_Entered,H74+1,\"\")","v":52},null,null,0,0,0,0,0]
[null,{"$f":"IF(AND(F75>0,E75>1),IF(Values_Entered,B75+0,\"\"),IF(Values_Entered,B75+1,\"\"))","v":53},null,null,0,0,null,{"$f":"IF(Values_Entered,H75+1,\"\")","v":53},null,null,0,0,0,0,0]
[null,{"$f":"IF(AND(F76>0,E76>1),IF(Values_Entered,B76+0,\"\"),IF(Values_Entered,B76+1,\"\"))","v":54},null,null,0,0,null,{"$f":"IF(Values_Entered,H76+1,\"\")","v":54},null,null,0,0,0,0,0]
[null,{"$f":"IF(AND(F77>0,E77>1),IF(Values_Entered,B77+0,\"\"),IF(Values_Entered,B77+1,\"\"))","v":55},null,null,0,0,null,{"$f":"IF(Values_Entered,H77+1,\"\")","v":55},null,null,0,0,0,0,0]
[null,{"$f":"IF(AND(F78>0,E78>1),IF(Values_Entered,B78+0,\"\"),IF(Values_Entered,B78+1,\"\"))","v":56},null,null,0,0,null,{"$f":"IF(Values_Entered,H78+1,\"\")","v":56},null,null,0,0,0,0,0]
[null,{"$f":"IF(AND(F79>0,E79>1),IF(Values_Entered,B79+0,\"\"),IF(Values_Entered,B79+1,\"\"))","v":57},null,null,0,0,null,{"$f":"IF(Values_Entered,H79+1,\"\")","v":57},null,null,0,0,0,0,0]
{"$rows_left_out":302}
{"sheet":"INFORMACION REQUERIDA","index":1,"n_rows":31,"n_cols":1,"rows_kept":31,"cut":false,"hidden":false,"merged":[]}
[]
["Información requerida para el uso del simulador:"]
[]
["Deben definir e incluir los siguientes datos:"]
[]
["1.  Tipo de tasa DTF o IBR"]
["2.  Determinar si es Reestructuración o Consolidación"]
["3.   Seleccionar el programa de credito al cual que corresponde la obligación"]
["4.    Nombre Beneficiario"]
["5.   Nit o Cedula del Beneficiario"]
["6.   Numero de operación"]
["7.  Saldo"]
["8.  Numero de cuotas a proyectar"]
["9.  Fecha de inicio de la consolidación corresponde a la fecha del día de la presentación  y en cuanto a la reestructuración es la fecha del ultimo vencimiento o novedad de a operación anterior."]
["10.  Se debe armar o proyectar el plan de pagos"]
["11. Valor enviado mensualmente atraves de intercambio en AGROS con el subsidio disponible"]
["12.  Ejecutar la opción de Excel  Pestaña  \"Datos\" opción  Análisis de Hipótesis- BUSCAR OBJETIVO, donde se debe diligenciar los siguientes datos:"]
[]
[]
[]
[]
[]
[]
[]
[]
[]
[]
[]
["12.  El simulador le indicara si es Viable o No Viable."]
["13.  Item BORRAR iniciar otra simulación."]
["14- Debe diligenciar el valor del subsidio disponible, el cual es reportado por FINAGRO los primeros 10 dias de cada mes por el aplicativo AGROS por ( Intercambio - Consulta - Tipo de Documento \"Aprobacion y Proyección de subsidio\")"]

{"sheet":"Hoja2","index":2,"n_rows":206,"n_cols":8,"rows_kept":206,"cut":false,"hidden":true,"merged":[]}
[null,"Programa","Int. Financiero","Finagro","Tasa int","Tasa IBR","CONSOLIDACION","DTF"]
[null,"AIS 2007 PEQUEÑO PRODUCTOR",6,0,-2,null,"REESTRUCTURACION","IBR"]
[null,"AIS 2007 MEDIANO PRODUCTOR",6,3,-2]
[null,"AIS 2007 GRAN PRODUCTOR",6,3,-2]
[null,"AIS 2007 PEQUEÑO PRODUCTOR CAPITALIZABLE",6,0,-2]
[null,"AIS 2007 MEDIANO PRODUCTOR CAPITALIZABLE",6,3,-2]
[null,"AIS 2007 GRAN PRODUCTOR CAPITALIZABLE",6,3,-2]
[null,"AIS 2008 PEQUEÑO PRODUCTOR",8,0,-2]
[null,"AIS 2008 MEDIANO PRODUCTOR",6,3,-2]
[null,"AIS 2008 GRAN PRODUCTOR",6,3,-2]
[null,"AIS 2008 PEQUEÑO PRODUCTOR_Agropecuaria",8,0,-2]
[null,"AIS 2008 MEDIANO PRODUCTOR_Agropecuaria",7,0,-2]
[null,"AIS 2008 GRAN PRODUCTOR_Agropecuaria",6,0,-2]
[null,"AIS 2008 PEQUEÑO PRODUCTOR_Fag Especial",8,0,-2]
[null,"AIS 2008 PEQUEÑO PRODUCTOR_Capitalizable",8,0,-2]
[null,"AIS 2008 MEDIANO PRODUCTOR_Agropecuaria_Capitalizable",7,0,-2]
[null,"AIS 2008 GRAN PRODUCTOR_Agropecuaria_Capitalizable",6,0,-2]
[null,"AIS 2009 PEQUEÑO PRODUCTOR",8,0,-2]
[null,"AIS 2009 MEDIANO PRODUCTOR",7,3,-2]
[null,"AIS 2009 GRAN PRODUCTOR",6,3,-2]
[null,"AIS 2009 GRAN PRODUCTOR_Capitalizable",6,3,-2]
[null,"AIS 2009 AGREMIACIONES PEQUEÑO PRODUCTOR_Capitalizable",8,0,-2]
[null,"AIS 2009 ASOCIACIONES PEQUEÑO PRODUCTOR_Capitalizable",8,0,-2]
[null,"AIS 2010 PEQUEÑO PRODUCTOR",6,0,0]
[null,"AIS 2010 MEDIANO PRODUCTOR",6,0,2]
[null,"AIS 2010 GRAN PRODUCTOR",5,0,2]
[null,"AIS 2011 PEQUEÑO PRODUCTOR",5,0,1]
[null,"AIS 2011 MEDIANO PRODUCTOR",6,0,2]
[null,"AIS 2012 PEQUEÑO PRODUCTOR",5,0,1]
[null,"AIS 2012 MEDIANO PRODUCTOR",6,0,2]
[null,"AIS 2013 PEQUEÑO PRODUCTOR",5,0,1]
[null,"AIS 2013 MEDIANO PRODUCTOR",6,0,2]
[null,"AIS 2014 PEQUEÑO PRODUCTOR",5,0,1]
[null,"AIS 2014 MEDIANO PRODUCTOR",6,0,2]
[null,"AIS 2015 PEQUEÑO PRODUCTOR",5,0,1]
[null,"AIS 2015 MEDIANO PRODUCTOR",6,0,2]
[null,"OLA INV 2010-2011 PEQUEÑO PRODUCTOR",6,0,-1]
[null,"OLA INV 2010-2011 MEDIANO PRODUCTOR",7,0,0]
[null,"OLA INV 2010-2011 GRAN PRODUCTOR",6,0,1]
[null,"OLA INV 2010-2011 PEQUEÑO PRODUCTOR_Fag Ordinario",6,0,-1]
[null,"OLA INV 2010-2011 MEDIANO PRODUCTOR_Fag Ordinario",7,0,0]
[null,"EXPORT 2008 PEQUEÑO PRODUCTOR",3.5,1,0]
[null,"EXPORT 2008 MEDIANO PRODUCTOR",3.5,1,0]
[null,"EXPORT 2008 GRAN PRODUCTOR",3.5,1,0]
[null,"EXPORT 2008 PEQUEÑO PRODUCTOR_Agropecuaria",4.5,0,0]
[null,"EXPORT 2008 MEDIANO PRODUCTOR_Agropecuaria",4.5,0,0]
[null,"EXPORT 2008 GRAN PRODUCTOR_Agropecuaria",4.5,0,0]
[null,"EXPORT 2008 GRAN PRODUCTOR_Capitalizable",6,3,0]
[null,"LEC COLOMBIA SIEMBRA 2016 JOVEN RURAL",7,0,0]
[null,"LEC COLOMBIA SIEMBRA 2016 PEQUEÑO PRODUCTOR",6,0,0]
[null,"LEC COLOMBIA SIEMBRA 2016 MEDIANO PRODUCTOR",6,0,1]
[null,"LEC COLOMBIA SIEMBRA 2016 GRAN PRODUCTOR",5,0,2]
[null,"LEC COLOMBIA SIEMBRA 2016 ESQUEMA ASOC.",5,0,0]
[null,"LEC COLOMBIA SIEMBRA 2016 ESQUEMA DE INTEGR.",6,0,0]
[null,"LEC RENOVACIÓN CAFE POR ZOCA 2016 PEQUEÑO PRODUCTOR",5,0,1]
[null,"LEC RENOVACIÓN CAFE POR ZOCA 2016",5,0,2]
[null,"LEC GENERAL 2016 JOVEN RURAL",6,0,1]
[null,"LEC GENERAL 2016 PEQUEÑO PRODUCTOR",5,0,1]
[null,"LEC GENERAL 2016 MEDIANO PRODUCTOR",5,0,2]
[null,"LEC GENERAL 2016 ESQUEMA ASOC.",4,0,1]
[null,"LEC GENERAL 2016 ESQUEMA DE INTEGR.",5,0,1]
[null,"LEC RETENCION VIENTRES 2016 PEQUEÑO PRODUCTOR",5,0,1]
[null,"LEC RETENCION VIENTRES 2016 MEDIANO PRODUCTOR",5,0,2]
[null,"LEC RETENCION VIENTRES 2016 GRAN PRODUCTOR",5,0,2]
[null,"LEC COLOMBIA SIEMBRA  2017 DE 1 A 36 MESES JOVEN RURAL",7,0,0]
[null,"LEC COLOMBIA SIEMBRA  2017 DE 1 A 36 MESES PEQUEÑO PRODUCTOR",6,0,0]
[null,"LEC COLOMBIA SIEMBRA  2017 DE 1 A 36 MESES MEDIANO PRODUCTOR",6,0,1]
[null,"LEC COLOMBIA SIEMBRA  2017 DE 1 A 36 MESES GRAN PRODUCTOR",5,0,2]
[null,"LEC COLOMBIA SIEMBRA  2017 DE 1 A 36 MESES ESQUEMA ASOC.",5,0,0]
[null,"LEC COLOMBIA SIEMBRA  2017 DE 1 A 36 MESES ESQUEMA DE INTEGR.",6,0,0]
[null,"LEC COLOMBIA SIEMBRA  2017 DE 37 A 60 MESES JOVEN RURAL",5,0,1]
[null,"LEC COLOMBIA SIEMBRA  2017 DE 37 A 60 MESES PEQUEÑO PRODUCTOR",5,0,1]
[null,"LEC COLOMBIA SIEMBRA  2017 DE 37 A 60 MESES MEDIANO PRODUCTOR",4,0,3]
[null,"LEC COLOMBIA SIEMBRA  2017 DE 37 A 60 MESES GRAN PRODUCTOR",3,0,4]
[null,"LEC COLOMBIA SIEMBRA  2017 DE 37 A 60 MESES ESQUEMA ASOC.",4,0,1]
[null,"LEC COLOMBIA SIEMBRA  2017 DE 37 A 60 MESES ESQUEMA DE INTEGR.",4,0,2]
[null,"LEC GENERAL 2017 DE 1 A 36 MESES JOVEN RURAL",6,0,1]
[null,"LEC GENERAL 2017 DE 1 A 36 MESES PEQUEÑO PRODUCTOR",5,0,1]
[null,"LEC GENERAL 2017 DE 1 A 36 MESES MEDIANO PRODUCTOR",5,0,2]
[null,"LEC GENERAL 2017 DE 1 A 36 MESES ESQUEMA ASOC.",4,0,1]
{"$rows_left_out":126}